{"text_format":"1","workbook":"xlsx","n_sheets":9,"sheets":["גדלי תיקים","נספח 1","נספח 2 - ","נספח 2","Sap_A","נספח 3א","נספח 3ב","נספח 3ג","נספח 4"],"not_rendered":{"charts":0,"images":0,"macros":0,"external_links":4,"defined_names":33,"comments":0,"pivot_tables":2},"unopened":[],"bounds":{"document_bytes":16777216,"sheet_cells":100000,"rows_first":2000,"rows_last":500,"rows_between":2000,"halvings":0,"cell_chars":16384,"cell_head_chars":4096},"cells_cut":0,"cells_raw":0,"read":"whole","date_system":"1900"}

{"sheet":"גדלי תיקים","index":0,"n_rows":142,"n_cols":11,"rows_kept":142,"cut":false,"hidden":true,"merged":[]}
[]
[]
[]
[null,"זמן","31/12/2021"]
[null,"מדידה","ש\"ח"]
[null,"פעילות","קבוצת מגדל"]
[null,"פרוטפוליו","סה\"כ נכסים"]
[]
[null,"תוויות שורה","שווי",null,null,null,null,null,null,null,"שיוך כפי שמופיע בטבלת ההמרה"]
[{"$f":"J10","v":110},"(110) מגדל   אלמנטר",3814156562.2499995,null,110," מגדל   אלמנטר",null,null,null,{"$f":"ABS(E10)","v":110},"סהכ נוסטרו"]
[{"$f":"J11","v":112},"(112) מגדל אחזקות נדל\"ן אלמנטר",114858302.09,null,112," מגדל אחזקות נדלן",null,null,null,{"$f":"ABS(E11)","v":112},"סהכ נוסטרו"]
[119,"(119) אשמורת תיכונה בע\"מ",21102501.050000001,null,119," מגדל אשמורת DW",null,null,null,119,"סהכ נוסטרו"]
[120,"(120) מגדל חברה לביטוח בעמ חיים",35115200512.050003,null,120," מגדל חברה לביטוח בעמ חיים",null,null,null,120,"סהכ נוסטרו"]
[121,"(121) מגדל חיים משתתפת ברווח",74126369856.23143,null,121," מגדל חיים משתתפת ברווח",null,null,null,121,"מגדל משתתף"]
[122,"(122) מגדל חיים נדלן",211454230.22000003,null,122," מגדל חיים נדלן",null,null,null,122,"סהכ נוסטרו"]
[123,"(123) מגדל נדלן משתתף ברווחים",6187197358.2299995,null,123," מגדל נדלן משתתף ברווחים",null,null,null,123,"מגדל משתתף"]
[124,"(124) מגדל   מגדלור",36495991753.956688,null,124," מגדל   מגדלור",null,null,null,124,"מגדל משתתף"]
[125,"(125) מגדל מסלול הלכה",692220921.19999909,null,125," מגדל   מסלול כשר",null,null,null,125,"מגדל משתתף"]
[126,"(126) מגדל   חיים מבטיח תשואה",493030060.07999974,null,126," מגדל   חיים מבטיח תשואה",null,null,null,126,"סהכ נוסטרו"]
[130,"(130) מגדל   הון",9501301051.7400017,null,130," מגדל   הון",null,null,null,130,"סהכ נוסטרו"]
{"$rows_left_out":123}
{"sheet":"נספח 1","index":1,"n_rows":14,"n_cols":12,"rows_kept":14,"cut":false,"hidden":false,"merged":[[5,3,6,3],[5,4,6,4],[4,11,6,11],[4,2,8,2]]}
[]
[null,null,"נספח 1 - צדדים קשורים - יתרות ועסקאות לרבעון המסתיים ביום  31 דצמבר 2024 - קופות גמל לתגמולים ולפיצויים"]
[]
[]
[null,null,"סה\"כ היקף עסקאות לפי שם צד קשור","יתרות",null,"עסקאות",null,null,null,null,null,"רכישת ני\"ע בהנפקות באמצעות צד קשור (חתם או מי ששיווק את ההנפקה)"]
[null,null,null,"יתרות השקעה לסוף התקופה","שיעור מסך נכסי ההשקעה","עסקאות שבוצעו בבורסה, בורסת חוץ או שוק מוסדר לרכישת או מכירת ני\"ע של צד קשור",null,"עסקאות שבוצעו לצורך השקעה בנכסים לא סחירים של צד קשור",null,"עסקאות מחוץ לבורסה, עסקאות מתואמות ועסקאות בנכסים אחרים שבוצעו מול צד קשור"]
[null,null,null,null,null,"רכישות","מכירות","רכישות","מכירות","רכישות","מכירות"]
[null,null,null,"באלפי ₪ ","%","באלפי ₪ ",null,"באלפי ₪ ",null,"באלפי ₪ ",null,"באלפי ₪ "]
[null,null,null,"נספח 2",null,"נספח 3א",null,"נספח 3ב",null,"נספח 3ג",null,"נספח 4"]
[null,"Fortissimo סה\"כ","Fortissimo","","",0,null,0,null,null,null,0]
[null,null,"מגדל שוקי הון",null,null,0,0]
[null,null,"מגדל ביטוח ",null,null,null,null,null,null,2.46]
[null,null,"הלוואות ליחידים"]
[null,null,"סה\"כ",0,0,0,0,0,0,2.46,0,0]

{"sheet":"נספח 2 - ","index":2,"n_rows":28,"n_cols":11,"rows_kept":28,"cut":false,"hidden":true,"merged":[]}
[]
[null,{"$f":"CONCATENATE(#REF!,\" \",#REF!,\" \",#REF!,\" \",#REF!)","v":{"$error":"#REF!"}}]
[null,"זמן","2010"]
[null,"מדידה","אלפי ש\"ח"]
[null,"סוג תיק","סה\"כ נכסים"]
[null,"פעילות","קבוצת מגדל"]
[null,"מנפיק","אמות"]
[null,"סלים\\מסלולים","לפי סלים"]
[]
[null,null,"מספר נייר ערך","שם המדרג","שיעור ריבית (%)","דירוג","מח\"מ (שנים)","תשואה לפדיון (%)","שיעור מהערך הנקוב המונפק (%)","ערך שוק / שווי הוגן / שווי בספרים (אלפי ₪)","שיעור מסך נכסי ההשקעה (%)"]
[null,"DW ","קוד נכס","שם מדרג","שיעור ריבית","דרוג מחושב",{"$f":"CUBEMEMBER(\"Migdal Hashkaot Neches Boded\",\"[Measures].[c_Macham]\")","v":"מח\"מ"},{"$f":"CUBEMEMBER(\"Migdal Hashkaot Neches Boded\",\"[Measures].[c_Tesua_Le_Pidyon]\")","v":"ת. לפדיון"},{"$f":"CUBEMEMBER(\"Migdal Hashkaot Neches Boded\",\"[Measures].[c_Hon_Nifra_Pct_Keren]\")","v":"שיעור מהע.נ המונפק"},{"$f":"CUBEMEMBER(\"Migdal Hashkaot Neches Boded\",\"[Measures].[c_Shovi_Keren]\")","v":"שווי שוק"},{"$f":"CUBEMEMBER(\"Migdal Hashkaot Neches Boded\",\"[Measures].[c_Achuz_Portfolio_Me_Tik]\")","v":"מתיק %"}]
[null,"אמות השקעות בע\"מ"]
[null,{"$f":"CUBEMEMBER(\"Migdal Hashkaot Neches Boded\",\"[Neches].[Hie Neches Boded].[Neches Boded L1].&[NechesBoded_L1_101]\")","v":"סה\"כ נכסים"},null,null,null,null,{"$f":"CUBEVALUE(\"Migdal Hashkaot Neches Boded\",$C$3,$C$4,$C$5,$C$6,$C$7,$C$8,$B13,G$11)","v":""},"","","",""]
[null,{"$f":"CUBEMEMBER(\"Migdal Hashkaot Neches Boded\",\"[Neches].[Hie Neches Boded].[Neches Boded L2].&[NechesBoded_L2_102]&[NechesBoded_L1_101]\")","v":"ב. ניירות ערך סחירים"},null,null,null,null,"","","","",""]
[null,"(1) אגרות חוב קונצרניות סחירות"]
[null,{"$f":"CUBEMEMBER(\"Migdal Hashkaot Neches Boded\",\"[Neches].[Hie Neches Boded].[Neches ID].&[49831]\")","v":"clP 4500 JAN"},{"$f":"CUBEMEMBERPROPERTY(\"Migdal Hashkaot Neches Boded\",\"[Neches].[Hie Neches Boded].[Neches ID].&[49831]\",\"קוד נכס\")","v":{"$error":"#N/A"}},{"$f":"CUBEMEMBERPROPERTY(\"Migdal Hashkaot Neches Boded\",\"[Neches].[Hie Neches Boded].[Neches ID].&[49831]\",\"שם מדרג\")","v":{"$error":"#N/A"}},{"$f":"CUBEMEMBERPROPERTY(\"Migdal Hashkaot Neches Boded\",\"[Neches].[Hie Neches Boded].[Neches ID].&[49831]\",\"שיעור ריבית\")","v":{"$error":"#N/A"}},{"$f":"CUBEMEMBERPROPERTY(\"Migdal Hashkaot Neches Boded\",\"[Neches].[Hie Neches Boded].[Neches ID].&[49831]\",\"דרוג מחושב\")","v":{"$error":"#N/A"}},{"$f":"CUBEVALUE(\"Migdal Hashkaot Neches Boded\",$C$3,$C$4,$C$5,$C$6,$C$7,$C$8,$B16,G$11)","v":""},{"$f":"CUBEVALUE(\"Migdal Hashkaot Neches Boded\",$C$3,$C$4,$C$5,$C$6,$C$7,$C$8,$B16,H$11)","v":""},{"$f":"CUBEVALUE(\"Migdal Hashkaot Neches Boded\",$C$3,$C$4,$C$5,$C$6,$C$7,$C$8,$B16,I$11)","v":""},{"$f":"CUBEVALUE(\"Migdal Hashkaot Neches Boded\",$C$3,$C$4,$C$5,$C$6,$C$7,$C$8,$B16,J$11)","v":""},{"$f":"CUBEVALUE(\"Migdal Hashkaot Neches Boded\",$C$3,$C$4,$C$5,$C$6,$C$7,$C$8,$B16,K$11)","v":""}]
[null,{"$f":"CUBEMEMBER(\"Migdal Hashkaot Neches Boded\",\"[Neches].[Hie Neches Boded].[Neches Boded L3].&[NechesBoded_L3_106]&[NechesBoded_L2_102]&[NechesBoded_L1_101]\")","v":"מניות (4)"}]
[null,{"$f":"CUBEMEMBER(\"Migdal Hashkaot Neches Boded\",\"[Neches].[Hie Neches Boded].[Neches Boded L5].&[NechesBoded_L5_118]&[NechesBoded_L4_116]&[NechesBoded_L3_106]&[NechesBoded_L2_102]&[NechesBoded_L1_101]\")","v":"תל אביב 75"}]
[null,{"$f":"CUBEMEMBER(\"Migdal Hashkaot Neches Boded\",\"[Neches].[Hie Neches Boded].[Neches ID].&[40912]\")","v":"כלל פיננס א ק1"},{"$f":"CUBEMEMBERPROPERTY(\"Migdal Hashkaot Neches Boded\",\"[Neches].[Hie Neches Boded].[Neches ID].&[40912]\",\"קוד נכס\")","v":{"$error":"#N/A"}},{"$f":"CUBEMEMBERPROPERTY(\"Migdal Hashkaot Neches Boded\",\"[Neches].[Hie Neches Boded].[Neches ID].&[40912]\",\"שם מדרג\")","v":{"$error":"#N/A"}},{"$f":"CUBEMEMBERPROPERTY(\"Migdal Hashkaot Neches Boded\",\"[Neches].[Hie Neches Boded].[Neches ID].&[40912]\",\"שיעור ריבית\")","v":{"$error":"#N/A"}},{"$f":"CUBEMEMBERPROPERTY(\"Migdal Hashkaot Neches Boded\",\"[Neches].[Hie Neches Boded].[Neches ID].&[40912]\",\"דרוג מחושב\")","v":{"$error":"#N/A"}},{"$f":"CUBEVALUE(\"Migdal Hashkaot Neches Boded\",$C$3,$C$4,$C$5,$C$6,$C$7,$C$8,$B19,G$11)","v":""},{"$f":"CUBEVALUE(\"Migdal Hashkaot Neches Boded\",$C$3,$C$4,$C$5,$C$6,$C$7,$C$8,$B19,H$11)","v":""},{"$f":"CUBEVALUE(\"Migdal Hashkaot Neches Boded\",$C$3,$C$4,$C$5,$C$6,$C$7,$C$8,$B19,I$11)","v":""},{"$f":"CUBEVALUE(\"Migdal Hashkaot Neches Boded\",$C$3,$C$4,$C$5,$C$6,$C$7,$C$8,$B19,J$11)","v":""},{"$f":"CUBEVALUE(\"Migdal Hashkaot Neches Boded\",$C$3,$C$4,$C$5,$C$6,$C$7,$C$8,$B19,K$11)","v":""}]
[null,{"$f":"CUBEMEMBER(\"Migdal Hashkaot Neches Boded\",\"[Neches].[Hie Neches Boded].[Neches Boded L3].&[NechesBoded_L3_109]&[NechesBoded_L2_102]&[NechesBoded_L1_101]\")","v":"כתבי אופציה (7)"}]
{"$rows_left_out":9}
{"sheet":"נספח 2","index":3,"n_rows":13,"n_cols":12,"rows_kept":13,"cut":false,"hidden":false,"merged":[]}
[null,"נספח 2 - צדדים קשורים - יתרות השקעה לרבעון המסתיים ביום 31 דצמבר 2024 - קופות גמל לתגמולים ולפיצויים"]
[]
[]
[null,"צד קשור ","שם נייר ערך","מספר נייר ערך","דירוג","שם מדרג","שיעור ריבית","מח\"מ (שנים)","תשואה לפדיון","שיעור מהערך הנקוב המונפק","שווי שוק (אלפי ₪)","שיעור מסך נכסי ההשקעה"]
[]
[null,"זמן","31/12/2024"]
[null,"מדידה","אלפי ש\"ח"]
[null,"סוג תיק","סה\"כ נכסים"]
[null,"פעילות","קופות גמל לתגמולים ולפיצויים"]
[null,"סלים\\מסלולים","אחזקה ישירה + מסלים"]
[]
[null,null,null,null,null,null,"ערכים"]
[null,"מנפיק","נכס","קוד נכס סאפ","דרוג","שם מדרג","שיעור ריבית","מח\"מ","ת. לפדיון","שיעור מהע.נ המונפק","שווי שוק","מתיק %"]

{"sheet":"Sap_A","index":4,"n_rows":950,"n_cols":13,"rows_kept":950,"cut":false,"hidden":true,"merged":[]}
[{"$f":"#REF!","v":{"$error":"#REF!"}},{"$f":"#REF!","v":{"$error":"#REF!"}},{"$f":"#REF!","v":{"$error":"#REF!"}},{"$f":"#REF!","v":{"$error":"#REF!"}},{"$f":"#REF!","v":{"$error":"#REF!"}},{"$f":"#REF!","v":{"$error":"#REF!"}},{"$f":"#REF!","v":{"$error":"#REF!"}},{"$f":"#REF!","v":{"$error":"#REF!"}},{"$f":"#REF!","v":{"$error":"#REF!"}},"שם חברה לדיווח","ק / מ","Concantinate",{"$f":"#REF!","v":{"$error":"#REF!"}}]
[{"$f":"#REF!","v":{"$error":"#REF!"}},{"$f":"#REF!","v":{"$error":"#REF!"}},{"$f":"#REF!","v":{"$error":"#REF!"}},{"$f":"#REF!","v":{"$error":"#REF!"}},{"$f":"#REF!","v":{"$error":"#REF!"}},{"$f":"#REF!","v":{"$error":"#REF!"}},{"$f":"#REF!*-1","v":{"$error":"#REF!"}},{"$f":"#REF!","v":{"$error":"#REF!"}},{"$f":"#REF!","v":{"$error":"#REF!"}},{"$f":"VLOOKUP(I2,'גדלי תיקים'!$J:$K,2,0)","v":{"$error":"#REF!"}},{"$f":"IF(OR(E2=\"מכירה\"),\"מ\",IF(OR(E2=\"רכישה\"),\"ק\",\"\"))","v":{"$error":"#REF!"}},{"$f":"CONCATENATE(J2,\"_\",A2,\"_\",K2,\"_\",M2)","v":{"$error":"#REF!"}},{"$f":"#REF!","v":{"$error":"#REF!"}}]
[{"$f":"#REF!","v":{"$error":"#REF!"}},{"$f":"#REF!","v":{"$error":"#REF!"}},{"$f":"#REF!","v":{"$error":"#REF!"}},{"$f":"#REF!","v":{"$error":"#REF!"}},{"$f":"#REF!","v":{"$error":"#REF!"}},{"$f":"#REF!","v":{"$error":"#REF!"}},{"$f":"#REF!*-1","v":{"$error":"#REF!"}},{"$f":"#REF!","v":{"$error":"#REF!"}},{"$f":"#REF!","v":{"$error":"#REF!"}},{"$f":"VLOOKUP(I3,'גדלי תיקים'!$J:$K,2,0)","v":{"$error":"#REF!"}},{"$f":"IF(OR(E3=\"מכירה\"),\"מ\",IF(OR(E3=\"רכישה\"),\"ק\",\"\"))","v":{"$error":"#REF!"}},{"$error":"#REF!"},{"$f":"#REF!","v":{"$error":"#REF!"}}]
[{"$f":"#REF!","v":{"$error":"#REF!"}},{"$f":"#REF!","v":{"$error":"#REF!"}},{"$f":"#REF!","v":{"$error":"#REF!"}},{"$f":"#REF!","v":{"$error":"#REF!"}},{"$f":"#REF!","v":{"$error":"#REF!"}},{"$f":"#REF!","v":{"$error":"#REF!"}},{"$f":"#REF!*-1","v":{"$error":"#REF!"}},{"$f":"#REF!","v":{"$error":"#REF!"}},{"$f":"#REF!","v":{"$error":"#REF!"}},{"$f":"VLOOKUP(I4,'גדלי תיקים'!$J:$K,2,0)","v":{"$error":"#REF!"}},{"$error":"#REF!"},{"$error":"#REF!"},{"$f":"#REF!","v":{"$error":"#REF!"}}]
[{"$f":"#REF!","v":{"$error":"#REF!"}},{"$f":"#REF!","v":{"$error":"#REF!"}},{"$f":"#REF!","v":{"$error":"#REF!"}},{"$f":"#REF!","v":{"$error":"#REF!"}},{"$f":"#REF!","v":{"$error":"#REF!"}},{"$f":"#REF!","v":{"$error":"#REF!"}},{"$f":"#REF!*-1","v":{"$error":"#REF!"}},{"$f":"#REF!","v":{"$error":"#REF!"}},{"$f":"#REF!","v":{"$error":"#REF!"}},{"$f":"VLOOKUP(I5,'גדלי תיקים'!$J:$K,2,0)","v":{"$error":"#REF!"}},{"$error":"#REF!"},{"$f":"CONCATENATE(J5,\"_\",A5,\"_\",K5,\"_\",M5)","v":{"$error":"#REF!"}},{"$f":"#REF!","v":{"$error":"#REF!"}}]
[{"$f":"#REF!","v":{"$error":"#REF!"}},{"$f":"#REF!","v":{"$error":"#REF!"}},{"$f":"#REF!","v":{"$error":"#REF!"}},{"$f":"#REF!","v":{"$error":"#REF!"}},{"$f":"#REF!","v":{"$error":"#REF!"}},{"$f":"#REF!","v":{"$error":"#REF!"}},{"$f":"#REF!*-1","v":{"$error":"#REF!"}},{"$f":"#REF!","v":{"$error":"#REF!"}},{"$f":"#REF!","v":{"$error":"#REF!"}},{"$f":"VLOOKUP(I6,'גדלי תיקים'!$J:$K,2,0)","v":{"$error":"#REF!"}},{"$error":"#REF!"},{"$f":"CONCATENATE(J6,\"_\",A6,\"_\",K6,\"_\",M6)","v":{"$error":"#REF!"}},{"$f":"#REF!","v":{"$error":"#REF!"}}]
[{"$f":"#REF!","v":{"$error":"#REF!"}},{"$f":"#REF!","v":{"$error":"#REF!"}},{"$f":"#REF!","v":{"$error":"#REF!"}},{"$f":"#REF!","v":{"$error":"#REF!"}},{"$f":"#REF!","v":{"$error":"#REF!"}},{"$f":"#REF!","v":{"$error":"#REF!"}},{"$f":"#REF!*-1","v":{"$error":"#REF!"}},{"$f":"#REF!","v":{"$error":"#REF!"}},{"$f":"#REF!","v":{"$error":"#REF!"}},{"$f":"VLOOKUP(I7,'גדלי תיקים'!$J:$K,2,0)","v":{"$error":"#REF!"}},{"$error":"#REF!"},{"$error":"#REF!"},{"$f":"#REF!","v":{"$error":"#REF!"}}]
[{"$f":"#REF!","v":{"$error":"#REF!"}},{"$f":"#REF!","v":{"$error":"#REF!"}},{"$f":"#REF!","v":{"$error":"#REF!"}},{"$f":"#REF!","v":{"$error":"#REF!"}},{"$f":"#REF!","v":{"$error":"#REF!"}},{"$f":"#REF!","v":{"$error":"#REF!"}},{"$f":"#REF!*-1","v":{"$error":"#REF!"}},{"$f":"#REF!","v":{"$error":"#REF!"}},{"$f":"#REF!","v":{"$error":"#REF!"}},{"$f":"VLOOKUP(I8,'גדלי תיקים'!$J:$K,2,0)","v":{"$error":"#REF!"}},{"$error":"#REF!"},{"$error":"#REF!"},{"$f":"#REF!","v":{"$error":"#REF!"}}]
[{"$f":"#REF!","v":{"$error":"#REF!"}},{"$f":"#REF!","v":{"$error":"#REF!"}},{"$f":"#REF!","v":{"$error":"#REF!"}},{"$f":"#REF!","v":{"$error":"#REF!"}},{"$f":"#REF!","v":{"$error":"#REF!"}},{"$f":"#REF!","v":{"$error":"#REF!"}},{"$f":"#REF!*-1","v":{"$error":"#REF!"}},{"$f":"#REF!","v":{"$error":"#REF!"}},{"$f":"#REF!","v":{"$error":"#REF!"}},{"$f":"VLOOKUP(I9,'גדלי תיקים'!$J:$K,2,0)","v":{"$error":"#REF!"}},{"$error":"#REF!"},{"$error":"#REF!"},{"$f":"#REF!","v":{"$error":"#REF!"}}]
[{"$f":"#REF!","v":{"$error":"#REF!"}},{"$f":"#REF!","v":{"$error":"#REF!"}},{"$f":"#REF!","v":{"$error":"#REF!"}},{"$f":"#REF!","v":{"$error":"#REF!"}},{"$f":"#REF!","v":{"$error":"#REF!"}},{"$f":"#REF!","v":{"$error":"#REF!"}},{"$f":"#REF!*-1","v":{"$error":"#REF!"}},{"$f":"#REF!","v":{"$error":"#REF!"}},{"$f":"#REF!","v":{"$error":"#REF!"}},{"$f":"VLOOKUP(I10,'גדלי תיקים'!$J:$K,2,0)","v":{"$error":"#REF!"}},{"$error":"#REF!"},{"$error":"#REF!"},{"$f":"#REF!","v":{"$error":"#REF!"}}]
[{"$f":"#REF!","v":{"$error":"#REF!"}},{"$f":"#REF!","v":{"$error":"#REF!"}},{"$f":"#REF!","v":{"$error":"#REF!"}},{"$f":"#REF!","v":{"$error":"#REF!"}},{"$f":"#REF!","v":{"$error":"#REF!"}},{"$f":"#REF!","v":{"$error":"#REF!"}},{"$f":"#REF!*-1","v":{"$error":"#REF!"}},{"$f":"#REF!","v":{"$error":"#REF!"}},{"$f":"#REF!","v":{"$error":"#REF!"}},{"$f":"VLOOKUP(I11,'גדלי תיקים'!$J:$K,2,0)","v":{"$error":"#REF!"}},{"$error":"#REF!"},{"$f":"CONCATENATE(J11,\"_\",A11,\"_\",K11)","v":{"$error":"#REF!"}}]
[{"$f":"#REF!","v":{"$error":"#REF!"}},{"$f":"#REF!","v":{"$error":"#REF!"}},{"$f":"#REF!","v":{"$error":"#REF!"}},{"$f":"#REF!","v":{"$error":"#REF!"}},{"$f":"#REF!","v":{"$error":"#REF!"}},{"$f":"#REF!","v":{"$error":"#REF!"}},{"$f":"#REF!*-1","v":{"$error":"#REF!"}},{"$f":"#REF!","v":{"$error":"#REF!"}},{"$f":"#REF!","v":{"$error":"#REF!"}},{"$f":"VLOOKUP(I12,'גדלי תיקים'!$J:$K,2,0)","v":{"$error":"#REF!"}},{"$error":"#REF!"},{"$error":"#REF!"}]
[{"$f":"#REF!","v":{"$error":"#REF!"}},{"$f":"#REF!","v":{"$error":"#REF!"}},{"$f":"#REF!","v":{"$error":"#REF!"}},{"$f":"#REF!","v":{"$error":"#REF!"}},{"$f":"#REF!","v":{"$error":"#REF!"}},{"$f":"#REF!","v":{"$error":"#REF!"}},{"$f":"#REF!*-1","v":{"$error":"#REF!"}},{"$f":"#REF!","v":{"$error":"#REF!"}},{"$f":"#REF!","v":{"$error":"#REF!"}},{"$f":"VLOOKUP(I13,'גדלי תיקים'!$J:$K,2,0)","v":{"$error":"#REF!"}},{"$error":"#REF!"},{"$error":"#REF!"}]
[{"$f":"#REF!","v":{"$error":"#REF!"}},{"$f":"#REF!","v":{"$error":"#REF!"}},{"$f":"#REF!","v":{"$error":"#REF!"}},{"$f":"#REF!","v":{"$error":"#REF!"}},{"$f":"#REF!","v":{"$error":"#REF!"}},{"$f":"#REF!","v":{"$error":"#REF!"}},{"$f":"#REF!*-1","v":{"$error":"#REF!"}},{"$f":"#REF!","v":{"$error":"#REF!"}},{"$f":"#REF!","v":{"$error":"#REF!"}},{"$f":"VLOOKUP(I14,'גדלי תיקים'!$J:$K,2,0)","v":{"$error":"#REF!"}},{"$error":"#REF!"},{"$error":"#REF!"}]
[{"$f":"#REF!","v":{"$error":"#REF!"}},{"$f":"#REF!","v":{"$error":"#REF!"}},{"$f":"#REF!","v":{"$error":"#REF!"}},{"$f":"#REF!","v":{"$error":"#REF!"}},{"$f":"#REF!","v":{"$error":"#REF!"}},{"$f":"#REF!","v":{"$error":"#REF!"}},{"$f":"#REF!*-1","v":{"$error":"#REF!"}},{"$f":"#REF!","v":{"$error":"#REF!"}},{"$f":"#REF!","v":{"$error":"#REF!"}},{"$f":"VLOOKUP(I15,'גדלי תיקים'!$J:$K,2,0)","v":{"$error":"#REF!"}},{"$error":"#REF!"},{"$error":"#REF!"}]
[{"$f":"#REF!","v":{"$error":"#REF!"}},{"$f":"#REF!","v":{"$error":"#REF!"}},{"$f":"#REF!","v":{"$error":"#REF!"}},{"$f":"#REF!","v":{"$error":"#REF!"}},{"$f":"#REF!","v":{"$error":"#REF!"}},{"$f":"#REF!","v":{"$error":"#REF!"}},{"$f":"#REF!*-1","v":{"$error":"#REF!"}},{"$f":"#REF!","v":{"$error":"#REF!"}},{"$f":"#REF!","v":{"$error":"#REF!"}},{"$f":"VLOOKUP(I16,'גדלי תיקים'!$J:$K,2,0)","v":{"$error":"#REF!"}},{"$error":"#REF!"},{"$error":"#REF!"}]
[{"$f":"#REF!","v":{"$error":"#REF!"}},{"$f":"#REF!","v":{"$error":"#REF!"}},{"$f":"#REF!","v":{"$error":"#REF!"}},{"$f":"#REF!","v":{"$error":"#REF!"}},{"$f":"#REF!","v":{"$error":"#REF!"}},{"$f":"#REF!","v":{"$error":"#REF!"}},{"$f":"#REF!*-1","v":{"$error":"#REF!"}},{"$f":"#REF!","v":{"$error":"#REF!"}},{"$f":"#REF!","v":{"$error":"#REF!"}},{"$f":"VLOOKUP(I17,'גדלי תיקים'!$J:$K,2,0)","v":{"$error":"#REF!"}},{"$error":"#REF!"},{"$error":"#REF!"}]
[{"$f":"#REF!","v":{"$error":"#REF!"}},{"$f":"#REF!","v":{"$error":"#REF!"}},{"$f":"#REF!","v":{"$error":"#REF!"}},{"$f":"#REF!","v":{"$error":"#REF!"}},{"$f":"#REF!","v":{"$error":"#REF!"}},{"$f":"#REF!","v":{"$error":"#REF!"}},{"$f":"#REF!*-1","v":{"$error":"#REF!"}},{"$f":"#REF!","v":{"$error":"#REF!"}},{"$f":"#REF!","v":{"$error":"#REF!"}},{"$f":"VLOOKUP(I18,'גדלי תיקים'!$J:$K,2,0)","v":{"$error":"#REF!"}},{"$error":"#REF!"},{"$error":"#REF!"}]
[{"$f":"#REF!","v":{"$error":"#REF!"}},{"$f":"#REF!","v":{"$error":"#REF!"}},{"$f":"#REF!","v":{"$error":"#REF!"}},{"$f":"#REF!","v":{"$error":"#REF!"}},{"$f":"#REF!","v":{"$error":"#REF!"}},{"$f":"#REF!","v":{"$error":"#REF!"}},{"$f":"#REF!*-1","v":{"$error":"#REF!"}},{"$f":"#REF!","v":{"$error":"#REF!"}},{"$f":"#REF!","v":{"$error":"#REF!"}},{"$f":"VLOOKUP(I19,'גדלי תיקים'!$J:$K,2,0)","v":{"$error":"#REF!"}},{"$error":"#REF!"},{"$error":"#REF!"}]
[{"$f":"#REF!","v":{"$error":"#REF!"}},{"$f":"#REF!","v":{"$error":"#REF!"}},{"$f":"#REF!","v":{"$error":"#REF!"}},{"$f":"#REF!","v":{"$error":"#REF!"}},{"$f":"#REF!","v":{"$error":"#REF!"}},{"$f":"#REF!","v":{"$error":"#REF!"}},{"$f":"#REF!*-1","v":{"$error":"#REF!"}},{"$f":"#REF!","v":{"$error":"#REF!"}},{"$f":"#REF!","v":{"$error":"#REF!"}},{"$f":"VLOOKUP(I20,'גדלי תיקים'!$J:$K,2,0)","v":{"$error":"#REF!"}},{"$error":"#REF!"},{"$error":"#REF!"}]
{"$rows_left_out":931}
{"sheet":"נספח 3א","index":5,"n_rows":13,"n_cols":7,"rows_kept":13,"cut":false,"hidden":false,"merged":[]}
[]
[null,null,null,null,"נספח 3א - צדדים קשורים - עסקאות שבוצעו בבורסה, בבורסת חוץ או שוק מוסדר לרכישת או מכירת ניירות ערך סחירים של צד קשור לרבעון המסתיים ביום 31 דצמבר 2024 - קופות גמל לתגמולים ולפיצויים"]
[]
[null,null,null,null,"קופות גמל לתגמולים ולפיצויים"]
[]
[null,null,null,null,"סה\"כ היקף עסקאות לצורך רכישה או מכירה של ני\"ע של צד קשור",0,0]
[null,null,"מס' ני\"ע","concantinate","צד קשור - מגדל שוקי הון בע\"מ","שווי עסקאות הרכישה (באלפי ₪)","שווי עסקאות המכירה (באלפי ₪)"]
[null,null,null,null,"א. ניירות ערך סחירים"]
[null,null,null,null,"מניות"]
[null,null,"מגדל שוקי הון","תעודת סל","תעודות סל",0,0]
[null,0,"מגדל שוקי הון","תעודות סל על אגח","אופציות, כתבי אופציות וחוזים עתידיים",0,0]
[null,null,null,null,"ניירות ערך אחרים"]
[null,null,null,null,"סה\"כ היקף עסקאות לצורך רכישה או מכירה של ני\"ע של צד קשור",0,0]

{"sheet":"נספח 3ב","index":6,"n_rows":35,"n_cols":12,"rows_kept":35,"cut":false,"hidden":false,"merged":[]}
[]
[null,null,null,null,null,"נספח 3ב - עסקאות שבוצעו לצורך השקעה בנכסים לא סחירים של צד קשור לרבעון המסתיים ביום 31 דצמבר 2024 - קופות גמל לתגמולים ולפיצויים"]
[]
[null,null,null,null,null,"קופות גמל לתגמולים ולפיצויים"]
[]
[null,"Sort","מס' ני\"ע","concantinate","קניה / מכירה","צד קשור ","תאריך","דירוג","שם מדרג","שיעור ריבית","שיעור מהערך הנקוב המונפק","שווי העסקה (רכישה / מכירה)"]
[null,0,null,null,null,"א. ניירות ערך לא סחירים"]
[null,0,null,null,null,"אגרות חוב קונצרניות לא סחירות"]
[null,0,2101,"קופות גמל לתגמולים ולפיצויים_2101_ק","ק",null,null,null,null,null,null,0]
[null,0,null,"קופות גמל לתגמולים ולפיצויים_2101_מ","מ"]
[null,0,null,null,null,"מניות לא סחירות"]
[null,0,null,"קופות גמל לתגמולים ולפיצויים__ק","ק",{"$error":"#N/A"},null,null,null,null,null,0]
[null,0,null,"קופות גמל לתגמולים ולפיצויים__מ","מ"]
[null,0,null,null,null,"כתבי אופציה לא סחירים"]
[null,0,null,"קופות גמל לתגמולים ולפיצויים__ק","ק",{"$error":"#N/A"},null,null,null,null,null,0]
[null,0,null,"קופות גמל לתגמולים ולפיצויים__מ","מ"]
[null,0,null,null,null,"סה\"כ ניירות ערך לא סחירים",null,null,null,null,null,0]
[]
[null,0,null,null,null,"ב. פקדונות מעל 3 חודשים"]
[null,0,null,"קופות גמל לתגמולים ולפיצויים_2101_ק","ק",{"$error":"#N/A"},null,null,null,null,null,0]
{"$rows_left_out":16}
{"sheet":"נספח 3ג","index":7,"n_rows":25,"n_cols":12,"rows_kept":25,"cut":false,"hidden":false,"merged":[]}
[]
[null,null,null,null,null,"נספח 3ג - צדדים קשורים - עסקאות מחוץ לבורסה, עסקאות מתואמות בבורסה ועסקאות בנכסים אחרים לא סחירים שבוצעו מול צדדים קשורים לרבעון המסתיים ביום 31 דצמבר 2024 - קופות גמל לתגמולים ולפיצויים"]
[]
[null,null,null,null,null,"קופות גמל לתגמולים ולפיצויים"]
[]
[null,"Sort","מס' ני\"ע","concantinate","קניה / מכירה","צד קשור ","תאריך","מס' ני\"ע","שער בורסה סוף יום מסחר","שער העסקה","שיעור מהערך הנקוב המונפק","שווי העסקה (רכישה / מכירה)"]
[null,0,null,null,null,"א. עסקאות מחוץ לבורסה ועסקאות מתואמות בבורסה"]
[null,0,null,null,null,"אגרות חוב ממשלתיות סחירות, לרבות מול עושה שוק (רכישות)"]
[null,0,null,"קופות גמל לתגמולים ולפיצויים__ק","ק",null,null,null,null,null,null,0]
[null,0,null,"קופות גמל לתגמולים ולפיצויים__מ","מ"]
[null,0,null,null,null,"אגרות חוב ממשלתיות סחירות, לרבות מול עושה שוק (מכירות)"]
[null,0,null,"קופות גמל לתגמולים ולפיצויים__ק","ק",null,null,null,null,null,null,0]
[null,0,null,"קופות גמל לתגמולים ולפיצויים__מ","מ"]
[null,0,null,null,null,"אגרות חוב קונצרניות סחירות "]
[null,0,null,"קופות גמל לתגמולים ולפיצויים__ק","ק",null,null,null,null,null,null,0]
[null,0,null,"קופות גמל לתגמולים ולפיצויים__מ","מ"]
[null,0,null,null,null,"מניות וניירות ערך אחרים"]
[null,0,null,"קופות גמל לתגמולים ולפיצויים__ק","ק",null,null,null,null,null,null,0]
[null,0,null,"קופות גמל לתגמולים ולפיצויים__מ","מ"]
[]
{"$rows_left_out":6}
{"sheet":"נספח 4","index":8,"n_rows":27,"n_cols":10,"rows_kept":27,"cut":false,"hidden":false,"merged":[]}
[]
[null,null,null,null,null,"נספח 4 - רכישת נייר ערך בהנפקות באמצעות חתם קשור או באמצעות צד קשור ששיווק את ההנפקה לרבעון המסתיים ביום 31 דצמבר 2024 - קופות גמל לתגמולים ולפיצויים"]
[]
[null,null,null,null,null,"קופות גמל לתגמולים ולפיצויים"]
[]
[null,"Sort","מס' ני\"ע","concantinate","קניה / מכירה","צד קשור  - מגדל שוקי הון","תאריך ההנפקה","מס' ני\"ע","שיעור מהערך הנקוב המונפק","שווי עסקת הרכישה (אלפי ₪)"]
[null,0,null,null,null,"א. ניירות ערך סחירים"]
[null,0,null,null,null,"אגרות חוב קונצרניות סחירות "]
[null,0,null,"קופות גמל לתגמולים ולפיצויים__ק","ק"]
[null,0,null,"קופות גמל לתגמולים ולפיצויים__מ","מ"]
[null,0,null,"קופות גמל לתגמולים ולפיצויים__ק","ק"]
[null,0,null,"קופות גמל לתגמולים ולפיצויים__מ","מ"]
[null,0,null,null,null,"מניות וניירות ערך אחרים"]
[null,0,null,"קופות גמל לתגמולים ולפיצויים__ק","ק",{"$error":"#N/A"},null,null,null,0]
[null,0,null,"קופות גמל לתגמולים ולפיצויים__מ","מ"]
[null,0,null,null,null,"סה\"כ ניירות ערך סחירים",null,null,null,0]
[]
[null,0,null,null,null,"ב. ניירות ערך לא סחירים"]
[null,0,null,null,null,"אגרות חוב קונצרניות לא סחירות "]
[null,0,null,"קופות גמל לתגמולים ולפיצויים__ק","ק",{"$error":"#N/A"},null,null,null,0]
{"$rows_left_out":7}